Reaction Details
TargetIntegrin alpha-IIb/beta-3
LigandBDBM50074047
Substrate/Competitorn/a
Meas. Tech.ChEMBL_70312 (CHEMBL678017)
Ki 500±n/a nM
Citation Keenan, RMCallahan, JFSamanen, JMBondinell, WECalvo, RRChen, LDeBrosse, CEggleston, DSHaltiwanger, RCHwang, SMJakas, DRKu, TWMiller, WHNewlander, KANichols, AParker, MFSouthhall, LSUzinskas, IVasko-Moser, JAVenslavsky, JWWong, ASHuffman, WF Conformational preferences in a benzodiazepine series of potent nonpeptide fibrinogen receptor antagonists. J Med Chem42:545-59 (1999) 
 
Integrin alpha-IIb/beta-3
Name:Integrin alpha-IIb/beta-3
Synonyms:Glycoprotein IIb/IIIa
Type:n/a
Mol. Mass.:n/a
Description:ASSAY_ID of EBI is 30109
Components:This complex has 2 components.
Component 1
Name:Integrin beta-3
Type:Protein
Mol. Mass.:87038.91
Organism:Homo sapiens (Human)
Description:P05106
Residue:788
Component 2
Name:Integrin alpha-IIb
Synonyms:CD_antigen=CD41 GPIIb Glycoprotein IIb ITGA2B Integrin alpha-IIb heavy chain Integrin alpha-IIb light chain, form 2 Integrin alpha-V/beta-3 and alpha-IIb/beta 3 | Platelet membrane glycoprotein IIb
Type:Protein
Mol. Mass.:113354.85
Organism:Homo sapiens (Human)
Description:P08514
Residue:1039
BDBM50074047
NameBDBM50074047
Synonyms:CHEMBL153083 | [(R)-8-(4-Carbamimidoyl-phenylcarbamoyl)-3-oxo-4-phenethyl-2,3,4,5-tetrahydro-1H-benzo[e][1,4]diazepin-2-yl]-acetic acid
TypeSmall organic molecule
Emp. Form.C27H27N5O4
Mol. Mass.485.5344
SMILESNC(=N)c1ccc(NC(=O)c2ccc3CN(CCc4ccccc4)C(=O)[C@@H](CC(O)=O)Nc3c2)cc1