Reaction Details
Target5-hydroxytryptamine receptor 1D
LigandBDBM50074155
Substrate/Competitorn/a
Meas. Tech.ChEMBL_1701 (CHEMBL616908)
IC50 2.5±n/a nM
Citation Sternfeld, FGuiblin, ARJelley, RAMatassa, VGReeve, AJHunt, PABeer, MSHeald, AStanton, JASohal, BWatt, APStreet, LJ Synthesis and serotonergic activity of 3-[2-(pyrrolidin-1-yl)ethyl]indoles: potent agonists for the h5-HT1D receptor with high selectivity over the h5-HT1B receptor. J Med Chem42:677-90 (1999) 
 
5-hydroxytryptamine receptor 1D
Name:5-hydroxytryptamine receptor 1D
Type:G Protein-Coupled Receptor (GPCR)
Mol. Mass.:41920.63
Organism:Homo sapiens (Human)
Description:Receptor binding assays were performed using human clone stably expressed in CHO cells.
Residue:377
BDBM50074155
NameBDBM50074155
Synonyms:((S)-1-Phenyl-ethyl)-{(S)-1-[2-(5-[1,2,4]triazol-1-ylmethyl-1H-indol-3-yl)-ethyl]-pyrrolidin-3-ylmethyl}-amine | CHEMBL424154
TypeSmall organic molecule
Emp. Form.C26H32N6
Mol. Mass.428.5725
SMILESC[C@H](NC[C@@H]1CCN(CCc2c[nH]c3ccc(Cn4cncn4)cc23)C1)c1ccccc1