Reaction Details
Target5-hydroxytryptamine receptor 1D
LigandBDBM50060427
Substrate/Competitorn/a
Meas. Tech.ChEMBL_1701 (CHEMBL616908)
IC50 0.7±n/a nM
Citation Sternfeld, FGuiblin, ARJelley, RAMatassa, VGReeve, AJHunt, PABeer, MSHeald, AStanton, JASohal, BWatt, APStreet, LJ Synthesis and serotonergic activity of 3-[2-(pyrrolidin-1-yl)ethyl]indoles: potent agonists for the h5-HT1D receptor with high selectivity over the h5-HT1B receptor. J Med Chem42:677-90 (1999) 
 
5-hydroxytryptamine receptor 1D
Name:5-hydroxytryptamine receptor 1D
Type:G Protein-Coupled Receptor (GPCR)
Mol. Mass.:41920.63
Organism:Homo sapiens (Human)
Description:Receptor binding assays were performed using human clone stably expressed in CHO cells.
Residue:377
BDBM50060427
NameBDBM50060427
Synonyms:Benzyl-methyl-{(S)-1-[2-(5-[1,2,4]triazol-4-yl-1H-indol-3-yl)-ethyl]-pyrrolidin-3-ylmethyl}-amine | CHEMBL117579
TypeSmall organic molecule
Emp. Form.C25H30N6
Mol. Mass.414.5459
SMILESCN(C[C@@H]1CCN(CCc2c[nH]c3ccc(cc23)-n2cnnc2)C1)Cc1ccccc1