Reaction Details
TargetAdenosine receptor A2a
LigandBDBM50074221
Substrate/Competitorn/a
Meas. Tech.ChEMBL_30012 (CHEMBL641303)
Ki 10.3±n/a nM
Citation Li, AHMoro, SForsyth, NMelman, NJi, XDJacobson, KA Synthesis, CoMFA analysis, and receptor docking of 3,5-diacyl-2, 4-dialkylpyridine derivatives as selective A3 adenosine receptor antagonists. J Med Chem42:706-21 (1999) 
 
Adenosine receptor A2a
Name:Adenosine receptor A2a
Type:G Protein-Coupled Receptor (GPCR)
Mol. Mass.:45015.65
Organism:Rattus norvegicus (rat)
Description:Rat A2A receptors expressed in CHO cells.
Residue:410
BDBM50074221
NameBDBM50074221
Synonyms:6-Ethyl-5-ethylsulfanylcarbonyl-4-(2-hydroxy-ethyl)-2-phenyl-nicotinic acid propyl ester | CHEMBL162666
TypeSmall organic molecule
Emp. Form.C22H27NO4S
Mol. Mass.401.519
SMILESCCCOC(=O)c1c(CCO)c(C(=O)SCC)c(CC)nc1-c1ccccc1