Reaction Details
TargetAdenosine receptor A3
LigandBDBM50074231
Substrate/Competitorn/a
Meas. Tech.ChEMBL_31865 (CHEMBL644094)
Ki 20±n/a nM
Citation Li, AHMoro, SForsyth, NMelman, NJi, XDJacobson, KA Synthesis, CoMFA analysis, and receptor docking of 3,5-diacyl-2, 4-dialkylpyridine derivatives as selective A3 adenosine receptor antagonists. J Med Chem42:706-21 (1999) 
 
Adenosine receptor A3
Name:Adenosine receptor A3
Type:G Protein-Coupled Receptor (GPCR)
Mol. Mass.:36197.32
Organism:Homo sapiens (Human)
Description:P0DMS8
Residue:318
BDBM50074231
NameBDBM50074231
Synonyms:4,6-Diethyl-5-ethylsulfanylcarbonyl-2-phenyl-nicotinic acid ethyl ester ethyl 4,6-diethyl-5-(ethylthiocarbonyl)-2-phenylnicotinate
TypeSmall organic molecule
Emp. Form.C21H25NO3S
Mol. Mass.371.493
SMILESCCOC(=O)c1c(CC)c(C(=O)SCC)c(CC)nc1-c1ccccc1