Reaction Details
TargetRetinoic acid receptor RXR-gamma
LigandBDBM50074300
Substrate/Competitorn/a
Meas. Tech.ChEMBL_197240 (CHEMBL803362)
Ki 5±n/a nM
Citation Canan Koch, SSDardashti, LJCesario, RMCroston, GEBoehm, MFHeyman, RANadzan, AM Synthesis of retinoid X receptor-specific ligands that are potent inducers of adipogenesis in 3T3-L1 cells. J Med Chem42:742-50 (1999) 
 
Retinoic acid receptor RXR-gamma
Name:Retinoic acid receptor RXR-gamma
Type:PROTEIN
Mol. Mass.:50878.26
Organism:Homo sapiens (Human)
Description:ChEMBL_197216
Residue:463
BDBM50074300
NameBDBM50074300
Synonyms:4-[[(E)-Hydroxyimino]-(3,5,5,8,8-pentamethyl-5,6,7,8-tetrahydro-naphthalen-2-yl)-methyl]-benzoic acid | CHEMBL162334
TypeSmall organic molecule
Emp. Form.C23H27NO3
Mol. Mass.365.4654
SMILESCc1cc2c(cc1C(N=O)c1ccc(cc1)C(O)=O)C(C)(C)CCC2(C)C