Reaction Details
TargetRetinoic acid receptor RXR-gamma
LigandBDBM50074299
Substrate/Competitorn/a
Meas. Tech.ChEMBL_197240 (CHEMBL803362)
Ki 42±n/a nM
Citation Canan Koch, SSDardashti, LJCesario, RMCroston, GEBoehm, MFHeyman, RANadzan, AM Synthesis of retinoid X receptor-specific ligands that are potent inducers of adipogenesis in 3T3-L1 cells. J Med Chem42:742-50 (1999) 
 
Retinoic acid receptor RXR-gamma
Name:Retinoic acid receptor RXR-gamma
Type:PROTEIN
Mol. Mass.:50878.26
Organism:Homo sapiens (Human)
Description:ChEMBL_197216
Residue:463
BDBM50074299
NameBDBM50074299
Synonyms:4-[[(E)-Ethoxyimino]-(3,5,5,8,8-pentamethyl-5,6,7,8-tetrahydro-naphthalen-2-yl)-methyl]-benzoic acid | CHEMBL166201
TypeSmall organic molecule
Emp. Form.C25H31NO3
Mol. Mass.393.5185
SMILESCCO\N=C(/c1ccc(cc1)C(O)=O)c1cc2c(cc1C)C(C)(C)CCC2(C)C