Reaction Details
TargetCannabinoid receptor 2
LigandBDBM50074311
Substrate/Competitorn/a
Meas. Tech.ChEMBL_47004 (CHEMBL657998)
Ki 577±n/a nM
Citation Lan, RLiu, QFan, PLin, SFernando, SRMcCallion, DPertwee, RMakriyannis, A Structure-activity relationships of pyrazole derivatives as cannabinoid receptor antagonists. J Med Chem42:769-76 (1999) 
 
Cannabinoid receptor 2
Name:Cannabinoid receptor 2
Type:Enzyme Catalytic Domain
Mol. Mass.:38220.43
Organism:MOUSE
Description:P47936
Residue:347
BDBM50074311
NameBDBM50074311
Synonyms:1-(2,4-Dichloro-phenyl)-5-(2-iodo-phenyl)-4-methyl-1H-pyrazole-3-carboxylic acid piperidin-1-ylamide | CHEMBL165134
TypeSmall organic molecule
Emp. Form.C22H21Cl2IN4O
Mol. Mass.555.239
SMILESCc1c(nn(c1-c1ccccc1I)-c1ccc(Cl)cc1Cl)C(=O)NN1CCCCC1