Reaction Details
TargetCannabinoid receptor 1
LigandBDBM21279
Substrate/Competitorn/a
Meas. Tech.ChEMBL_46641 (CHEMBL658897)
Ki 7.49±n/a nM
Citation Lan, RLiu, QFan, PLin, SFernando, SRMcCallion, DPertwee, RMakriyannis, A Structure-activity relationships of pyrazole derivatives as cannabinoid receptor antagonists. J Med Chem42:769-76 (1999) 
 
Cannabinoid receptor 1
Name:Cannabinoid receptor 1
Type:G Protein-Coupled Receptor (GPCR)
Mol. Mass.:52856.55
Organism:Rattus norvegicus (rat)
Description:P20272
Residue:473
BDBM21279
NameBDBM21279
Synonyms:1-(2,4-dichlorophenyl)-5-(4-iodophenyl)-4-methyl-N-(piperidin-1-yl)-1H-pyrazole-3-carboxamide AM-251 CHEMBL285932 | N-(piperidin-1-yl)-1-(2,4-dichlorophenyl)-5-(4-iodophenyl)-4-methyl-1H-pyrazole-3-carboxamide
TypeSmall organic molecule
Emp. Form.C22H21Cl2IN4O
Mol. Mass.555.239
SMILESCc1c(nn(c1-c1ccc(I)cc1)-c1ccc(Cl)cc1Cl)C(=O)NN1CCCCC1