Reaction Details
TargetCannabinoid receptor 2
LigandBDBM50074319
Substrate/Competitorn/a
Meas. Tech.ChEMBL_47004 (CHEMBL657998)
Ki 252±n/a nM
Citation Lan, RLiu, QFan, PLin, SFernando, SRMcCallion, DPertwee, RMakriyannis, A Structure-activity relationships of pyrazole derivatives as cannabinoid receptor antagonists. J Med Chem42:769-76 (1999) 
 
Cannabinoid receptor 2
Name:Cannabinoid receptor 2
Type:Enzyme Catalytic Domain
Mol. Mass.:38220.43
Organism:MOUSE
Description:P47936
Residue:347
BDBM50074319
NameBDBM50074319
Synonyms:1-(2,4-Dichloro-phenyl)-4-methyl-5-(4-nitro-phenyl)-1H-pyrazole-3-carboxylic acid piperidin-1-ylamide | CHEMBL349512
TypeSmall organic molecule
Emp. Form.C22H21Cl2N5O3
Mol. Mass.474.34
SMILESCc1c(nn(c1-c1ccc(cc1)[N+]([O-])=O)-c1ccc(Cl)cc1Cl)C(=O)NN1CCCCC1