Reaction Details
TargetCannabinoid receptor 2
LigandBDBM50074324
Substrate/Competitorn/a
Meas. Tech.ChEMBL_47004 (CHEMBL657998)
Ki 836.0±n/a nM
Citation Lan, RLiu, QFan, PLin, SFernando, SRMcCallion, DPertwee, RMakriyannis, A Structure-activity relationships of pyrazole derivatives as cannabinoid receptor antagonists. J Med Chem42:769-76 (1999) 
 
Cannabinoid receptor 2
Name:Cannabinoid receptor 2
Type:Enzyme Catalytic Domain
Mol. Mass.:38220.43
Organism:MOUSE
Description:P47936
Residue:347
BDBM50074324
NameBDBM50074324
Synonyms:1,5-Bis-(4-chloro-phenyl)-4-methyl-1H-pyrazole-3-carboxylic acid piperidin-1-ylamide | CHEMBL36250
TypeSmall organic molecule
Emp. Form.C22H22Cl2N4O
Mol. Mass.429.342
SMILESCc1c(nn(c1-c1ccc(Cl)cc1)-c1ccc(Cl)cc1)C(=O)NN1CCCCC1