Reaction Details
TargetCannabinoid receptor 1
LigandBDBM50074324
Substrate/Competitorn/a
Meas. Tech.ChEMBL_46641 (CHEMBL658897)
Ki 60.4±n/a nM
Citation Lan, RLiu, QFan, PLin, SFernando, SRMcCallion, DPertwee, RMakriyannis, A Structure-activity relationships of pyrazole derivatives as cannabinoid receptor antagonists. J Med Chem42:769-76 (1999) 
 
Cannabinoid receptor 1
Name:Cannabinoid receptor 1
Type:G Protein-Coupled Receptor (GPCR)
Mol. Mass.:52856.55
Organism:Rattus norvegicus (rat)
Description:P20272
Residue:473
BDBM50074324
NameBDBM50074324
Synonyms:1,5-Bis-(4-chloro-phenyl)-4-methyl-1H-pyrazole-3-carboxylic acid piperidin-1-ylamide | CHEMBL36250
TypeSmall organic molecule
Emp. Form.C22H22Cl2N4O
Mol. Mass.429.342
SMILESCc1c(nn(c1-c1ccc(Cl)cc1)-c1ccc(Cl)cc1)C(=O)NN1CCCCC1