Reaction Details
TargetCorticotropin-releasing factor receptor 1
LigandBDBM50074336
Substrate/Competitorn/a
Meas. Tech.ChEMBL_51111 (CHEMBL666549)
Ki 5±n/a nM
Citation Arvanitis, AGGilligan, PJChorvat, RJCheeseman, RSChristos, TEBakthavatchalam, RBeck, JPCocuzza, AJHobbs, FWWilde, RGArnold, CChidester, DCurry, MHe, LHollis, AKlaczkiewicz, JKrenitsky, PJRescinito, JPScholfield, ECulp, SDe Souza, EBFitzgerald, LGrigoriadis, DTam, SWShen, HL Non-peptide corticotropin-releasing hormone antagonists: syntheses and structure-activity relationships of 2-anilinopyrimidines and -triazines. J Med Chem42:805-18 (1999) 
 
Corticotropin-releasing factor receptor 1
Name:Corticotropin-releasing factor receptor 1
Type:Enzyme
Mol. Mass.:50744.31
Organism:Homo sapiens (Human)
Description:P34998
Residue:444
BDBM50074336
NameBDBM50074336
Synonyms:1-{3-Bromo-4-[(4-diethylamino-6-methyl-pyrimidin-2-yl)-ethyl-amino]-phenyl}-ethanone | CHEMBL167177
TypeSmall organic molecule
Emp. Form.C19H25BrN4O
Mol. Mass.405.332
SMILESCCN(CC)c1cc(C)nc(n1)N(CC)c1ccc(cc1Br)C(C)=O