Reaction Details
TargetCorticotropin-releasing factor receptor 1
LigandBDBM50074449
Substrate/Competitorn/a
Meas. Tech.ChEMBL_51114 (CHEMBL664960)
Ki 4.7±n/a nM
Citation Chorvat, RJBakthavatchalam, RBeck, JPGilligan, PJWilde, RGCocuzza, AJHobbs, FWCheeseman, RSCurry, MRescinito, JPKrenitsky, PChidester, DYarem, JAKlaczkiewicz, JDHodge, CNAldrich, PEWasserman, ZRFernandez, CHZaczek, RFitzgerald, LWHuang, SMShen, HLWong, YNChien, BMArvanitis, A Synthesis, corticotropin-releasing factor receptor binding affinity, and pharmacokinetic properties of triazolo-, imidazo-, and pyrrolopyrimidines and -pyridines. J Med Chem42:833-48 (1999) 
 
Corticotropin-releasing factor receptor 1
Name:Corticotropin-releasing factor receptor 1
Type:Enzyme
Mol. Mass.:50744.31
Organism:Homo sapiens (Human)
Description:P34998
Residue:444
BDBM50074449
NameBDBM50074449
Synonyms:CHEMBL352353 | [3-(4-Isopropyl-2-methylsulfanyl-phenyl)-5-methyl-3H-[1,2,3]triazolo[4,5-b]pyridin-7-yl]-bis-(2-methoxy-ethyl)-amine
TypeSmall organic molecule
Emp. Form.C22H31N5O2S
Mol. Mass.429.579
SMILESCOCCN(CCOC)c1cc(C)nc2n(nnc12)-c1ccc(cc1SC)C(C)C