Reaction Details
TargetCorticotropin-releasing factor receptor 1
LigandBDBM50074491
Substrate/Competitorn/a
Meas. Tech.ChEMBL_51114 (CHEMBL664960)
Ki 9.7±n/a nM
Citation Chorvat, RJBakthavatchalam, RBeck, JPGilligan, PJWilde, RGCocuzza, AJHobbs, FWCheeseman, RSCurry, MRescinito, JPKrenitsky, PChidester, DYarem, JAKlaczkiewicz, JDHodge, CNAldrich, PEWasserman, ZRFernandez, CHZaczek, RFitzgerald, LWHuang, SMShen, HLWong, YNChien, BMArvanitis, A Synthesis, corticotropin-releasing factor receptor binding affinity, and pharmacokinetic properties of triazolo-, imidazo-, and pyrrolopyrimidines and -pyridines. J Med Chem42:833-48 (1999) 
 
Corticotropin-releasing factor receptor 1
Name:Corticotropin-releasing factor receptor 1
Type:Enzyme
Mol. Mass.:50744.31
Organism:Homo sapiens (Human)
Description:P34998
Residue:444
BDBM50074491
NameBDBM50074491
Synonyms:9-(2-Bromo-4-isopropyl-phenyl)-6-(1-methoxymethyl-propoxy)-2-methyl-9H-purine | CHEMBL170788
TypeSmall organic molecule
Emp. Form.C20H25BrN4O2
Mol. Mass.433.342
SMILESCCC(COC)Oc1nc(C)nc2n(cnc12)-c1ccc(cc1Br)C(C)C