Reaction Details
TargetCorticotropin-releasing factor receptor 1
LigandBDBM50074492
Substrate/Competitorn/a
Meas. Tech.ChEMBL_51114 (CHEMBL664960)
Ki 0.9±n/a nM
Citation Chorvat, RJBakthavatchalam, RBeck, JPGilligan, PJWilde, RGCocuzza, AJHobbs, FWCheeseman, RSCurry, MRescinito, JPKrenitsky, PChidester, DYarem, JAKlaczkiewicz, JDHodge, CNAldrich, PEWasserman, ZRFernandez, CHZaczek, RFitzgerald, LWHuang, SMShen, HLWong, YNChien, BMArvanitis, A Synthesis, corticotropin-releasing factor receptor binding affinity, and pharmacokinetic properties of triazolo-, imidazo-, and pyrrolopyrimidines and -pyridines. J Med Chem42:833-48 (1999) 
 
Corticotropin-releasing factor receptor 1
Name:Corticotropin-releasing factor receptor 1
Type:Enzyme
Mol. Mass.:50744.31
Organism:Homo sapiens (Human)
Description:P34998
Residue:444
BDBM50074492
NameBDBM50074492
Synonyms:CHEMBL168554 | [9-(2-Bromo-4-isopropyl-phenyl)-2,8-dimethyl-9H-purin-6-yl]-butyl-ethyl-amine
TypeSmall organic molecule
Emp. Form.C22H30BrN5
Mol. Mass.444.411
SMILESCCCCN(CC)c1nc(C)nc2n(c(C)nc12)-c1ccc(cc1Br)C(C)C