Reaction Details
TargetCorticotropin-releasing factor receptor 1
LigandBDBM50074495
Substrate/Competitorn/a
Meas. Tech.ChEMBL_51114 (CHEMBL664960)
Ki 3.9±n/a nM
Citation Chorvat, RJBakthavatchalam, RBeck, JPGilligan, PJWilde, RGCocuzza, AJHobbs, FWCheeseman, RSCurry, MRescinito, JPKrenitsky, PChidester, DYarem, JAKlaczkiewicz, JDHodge, CNAldrich, PEWasserman, ZRFernandez, CHZaczek, RFitzgerald, LWHuang, SMShen, HLWong, YNChien, BMArvanitis, A Synthesis, corticotropin-releasing factor receptor binding affinity, and pharmacokinetic properties of triazolo-, imidazo-, and pyrrolopyrimidines and -pyridines. J Med Chem42:833-48 (1999) 
 
Corticotropin-releasing factor receptor 1
Name:Corticotropin-releasing factor receptor 1
Type:Enzyme
Mol. Mass.:50744.31
Organism:Homo sapiens (Human)
Description:P34998
Residue:444
BDBM50074495
NameBDBM50074495
Synonyms:CHEMBL355049 | [3-(2-Bromo-4-isopropyl-phenyl)-2,5-dimethyl-3H-imidazo[4,5-b]pyridin-7-yl]-butyl-ethyl-amine
TypeSmall organic molecule
Emp. Form.C23H31BrN4
Mol. Mass.443.423
SMILESCCCCN(CC)c1cc(C)nc2n(c(C)nc12)-c1ccc(cc1Br)C(C)C