Reaction Details
TargetCorticotropin-releasing factor receptor 1
LigandBDBM50074527
Substrate/Competitorn/a
Meas. Tech.ChEMBL_51114 (CHEMBL664960)
Ki 9.8±n/a nM
Citation Chorvat, RJBakthavatchalam, RBeck, JPGilligan, PJWilde, RGCocuzza, AJHobbs, FWCheeseman, RSCurry, MRescinito, JPKrenitsky, PChidester, DYarem, JAKlaczkiewicz, JDHodge, CNAldrich, PEWasserman, ZRFernandez, CHZaczek, RFitzgerald, LWHuang, SMShen, HLWong, YNChien, BMArvanitis, A Synthesis, corticotropin-releasing factor receptor binding affinity, and pharmacokinetic properties of triazolo-, imidazo-, and pyrrolopyrimidines and -pyridines. J Med Chem42:833-48 (1999) 
 
Corticotropin-releasing factor receptor 1
Name:Corticotropin-releasing factor receptor 1
Type:Enzyme
Mol. Mass.:50744.31
Organism:Homo sapiens (Human)
Description:P34998
Residue:444
BDBM50074527
NameBDBM50074527
Synonyms:CHEMBL169641 | [3-(2-Bromo-4-isopropyl-phenyl)-2,5-dimethyl-3H-imidazo[4,5-b]pyridin-7-yl]-bis-(2-methoxy-ethyl)-amine
TypeSmall organic molecule
Emp. Form.C23H31BrN4O2
Mol. Mass.475.422
SMILESCOCCN(CCOC)c1cc(C)nc2n(c(C)nc12)-c1ccc(cc1Br)C(C)C