Reaction Details
TargetCannabinoid receptor 1
LigandBDBM50056464
Substrate/Competitorn/a
Meas. Tech.ChEMBL_46817 (CHEMBL657061)
Ki 72.2±n/a nM
Citation Lang, WQin, CLin, SKhanolkar, ADGoutopoulos, AFan, PAbouzid, KMeng, ZBiegel, DMakriyannis, A Substrate specificity and stereoselectivity of rat brain microsomal anandamide amidohydrolase. J Med Chem42:896-902 (1999) 
 
Cannabinoid receptor 1
Name:Cannabinoid receptor 1
Type:G Protein-Coupled Receptor (GPCR)
Mol. Mass.:52856.55
Organism:Rattus norvegicus (rat)
Description:P20272
Residue:473
BDBM50056464
NameBDBM50056464
Synonyms:(5Z,8Z,11Z,14Z)-2,2-Dimethyl-icosa-5,8,11,14-tetraenoic acid (2-hydroxy-ethyl)-amide | CHEMBL423382
TypeSmall organic molecule
Emp. Form.C24H41NO2
Mol. Mass.375.5878
SMILESCCCCC\C=C/C\C=C/C\C=C/C\C=C/CCC(C)(C)C(=O)NCCO