Reaction Details
TargetIntegrin alpha-5/beta-1
LigandBDBM50074661
Substrate/Competitorn/a
Meas. Tech.ChEMBL_217629 (CHEMBL820372)
IC50>100000±n/a nM
Citation Lin, KAteeq, HSHsiung, SHChong, LTZimmerman, CNCastro, ALee, WCHammond, CEKalkunte, SChen, LLPepinsky, RBLeone, DRSprague, AGAbraham, WMGill, ALobb, RRAdams, SP Selective, tight-binding inhibitors of integrin alpha4beta1 that inhibit allergic airway responses. J Med Chem42:920-34 (1999) 
 
Integrin alpha-5/beta-1
Name:Integrin alpha-5/beta-1
Type:Enzyme
Mol. Mass.:n/a
Description:n/a
Components:This complex has 2 components.
Component 1
Name:Integrin alpha-5
Synonyms:CD49 antigen-like family member E FNRA Fibronectin receptor subunit alpha ITGA5 Integrin alpha-F | VLA-5
Type:Single-pass type I membrane protein
Mol. Mass.:114523.00
Organism:Homo sapiens (Human)
Description:n/a
Residue:1049
Component 2
Name:Integrin beta-1
Synonyms:CD_antigen=CD29 Fibronectin receptor beta GPIIA ITGB1 MDF2 | MSK12
Type:Enzyme
Mol. Mass.:88400.38
Organism:Homo sapiens (Human)
Description:P05556
Residue:798
BDBM50074661
NameBDBM50074661
Synonyms:(S)-1-{(S)-2-[(S)-3-Carboxy-2-((S)-4-methyl-2-{2-[4-(3-o-tolyl-ureido)-phenyl]-acetylamino}-pentanoylamino)-propionylamino]-3-methyl-butyryl}-pyrrolidine-2-carboxylic acid CHEMBL88478
TypeSmall organic molecule
Emp. Form.C36H48N6O9
Mol. Mass.708.8011
SMILESCC(C)C[C@H](NC(=O)Cc1ccc(NC(=O)Nc2ccccc2C)cc1)C(=O)N[C@@H](CC(O)=O)C(=O)N[C@@H](C(C)C)C(=O)N1CCC[C@H]1C(O)=O