Reaction Details
TargetCarboxypeptidase G2
LigandBDBM50074679
Substrate/Competitorn/a
Meas. Tech.ChEMBL_45646 (CHEMBL873194)
Ki 5800±n/a nM
Citation Khan, THEno-Amooquaye, EASearle, FBrowne, PJOsborn, HMBurke, PJ Novel inhibitors of carboxypeptidase G2 (CPG2): potential use in antibody-directed enzyme prodrug therapy. J Med Chem42:951-6 (1999) 
 
Carboxypeptidase G2
Name:Carboxypeptidase G2
Synonyms:n/a
Type:PROTEIN
Mol. Mass.:44005.37
Organism:Pseudomonas aeruginosa
Description:ChEMBL_302801
Residue:412
BDBM50074679
NameBDBM50074679
TypeSmall organic molecule
Emp. Form.C12H14N2O5S
Mol. Mass.298.315
SMILESNc1ccc(SC(=O)NC(CCC(O)=O)C(O)=O)cc1