Reaction Details
TargetBifunctional dihydrofolate reductase-thymidylate synthase
LigandBDBM18512
Substrate/Competitorn/a
Meas. Tech.ChEMBL_53496 (CHEMBL665620)
IC50 390±n/a nM
Citation Rosowsky, APapoulis, ATForsch, RAQueener, SF Synthesis and antiparasitic and antitumor activity of 2, 4-diamino-6-(arylmethyl)-5,6,7,8-tetrahydroquinazoline analogues of piritrexim. J Med Chem42:1007-17 (1999) 
 
Bifunctional dihydrofolate reductase-thymidylate synthase
Name:Bifunctional dihydrofolate reductase-thymidylate synthase
Type:Enzyme
Mol. Mass.:68757.49
Organism:Toxoplasma gondii
Description:Q07422
Residue:610
BDBM18512
NameBDBM18512
Synonyms:5-(4-chlorophenyl)-6-ethylpyrimidine-2,4-diamine Pyrimethamine (Pyr) cid_4993
TypeSmall organic molecule
Emp. Form.C12H13ClN4
Mol. Mass.248.711
SMILESCCc1nc(N)nc(N)c1-c1ccc(Cl)cc1