Reaction Details
TargetEpidermal growth factor receptor
LigandBDBM50074742
Substrate/Competitorn/a
Meas. Tech.ChEMBL_67049 (CHEMBL677887)
IC50 64±n/a nM
Citation Traxler, PGreen, JMett, HSéquin, UFuret, P Use of a pharmacophore model for the design of EGFR tyrosine kinase inhibitors: isoflavones and 3-phenyl-4(1H)-quinolones. J Med Chem42:1018-26 (1999) 
 
Epidermal growth factor receptor
Name:Epidermal growth factor receptor
Type:Receptor Kinase Domain
Mol. Mass.:134279.59
Organism:Homo sapiens (Human)
Description:P00533
Residue:1210
BDBM50074742
NameBDBM50074742
Synonyms:CHEMBL7866 | [3-(3-Chloro-phenyl)-5-hydroxy-7-methoxy-4-oxo-4H-quinolin-1-yl]-acetic acid methyl ester
TypeSmall organic molecule
Emp. Form.C19H16ClNO5
Mol. Mass.373.787
SMILESCOC(=O)Cn1cc(-c2cccc(Cl)c2)c(=O)c2c(O)cc(OC)cc12