Reaction Details
TargetProstaglandin G/H synthase 2
LigandBDBM50074922
Substrate/Competitorn/a
Meas. Tech.ChEBML_159758
IC50 10±n/a nM
Citation Bayly, CIBlack, WCLéger, SOuimet, NOuellet, MPercival, MD Structure-based design of COX-2 selectivity into flurbiprofen. Bioorg Med Chem Lett9:307-12 (1999) Prostaglandin G/H synthase 2
Name:Prostaglandin G/H synthase 2
Type:Enzyme
Mol. Mass.:69003.89
Organism:Homo sapiens (Human)
Description:Recombinant Cox-2 provided by Cayman (Cayman Chemical Co.,Ann Arbor, MI).
Residue:604
BDBM50074922
NameBDBM50074922
Synonyms:(+-)-2-fluoro-alpha-methyl-4-biphenylacetic acid 2-(2-fluorobiphenyl-4-yl)propanoic acid 3-fluoro-4-phenylhydratropic acid CHEMBL563 US9630914, Compound A
TypeSmall organic molecule
Emp. Form.C15H13FO2
Mol. Mass.244.2609
SMILESCC(C(O)=O)c1ccc(c(F)c1)-c1ccccc1