Reaction Details
TargetcAMP-specific 3',5'-cyclic phosphodiesterase 4A
LigandBDBM50074967
Substrate/Competitorn/a
Meas. Tech.ChEBML_155037
IC50 560.0±n/a nM
Citation Perrier, HBayly, CLaliberté, FHuang, ZRasori, RRobichaud, AGirard, YMacdonald, D Substituted furans as inhibitors of the PDE4 enzyme. Bioorg Med Chem Lett9:323-6 (1999) cAMP-specific 3',5'-cyclic phosphodiesterase 4A
Name:cAMP-specific 3',5'-cyclic phosphodiesterase 4A
Type:Enzyme
Mol. Mass.:98113.27
Organism:Homo sapiens (Human)
Description:P27815
Residue:886
BDBM50074967
NameBDBM50074967
Synonyms:2,5-Bis-(3,4-dimethoxy-phenyl)-furan | CHEMBL110937
TypeSmall organic molecule
Emp. Form.C20H20O5
Mol. Mass.340.3698
SMILESCOc1ccc(cc1OC)-c1ccc(o1)-c1ccc(OC)c(OC)c1