Reaction Details
TargetcAMP-specific 3',5'-cyclic phosphodiesterase 4A
LigandBDBM50074968
Substrate/Competitorn/a
Meas. Tech.ChEBML_155037
IC50 190±n/a nM
Citation Perrier, HBayly, CLaliberté, FHuang, ZRasori, RRobichaud, AGirard, YMacdonald, D Substituted furans as inhibitors of the PDE4 enzyme. Bioorg Med Chem Lett9:323-6 (1999) cAMP-specific 3',5'-cyclic phosphodiesterase 4A
Name:cAMP-specific 3',5'-cyclic phosphodiesterase 4A
Type:Enzyme
Mol. Mass.:98113.27
Organism:Homo sapiens (Human)
Description:P27815
Residue:886
BDBM50074968
NameBDBM50074968
Synonyms:2-[5-(3-Cyclopentyloxy-4-methoxy-phenyl)-furan-2-yl]-quinoline | CHEMBL326981
TypeSmall organic molecule
Emp. Form.C25H23NO3
Mol. Mass.385.455
SMILESCOc1ccc(cc1OC1CCCC1)-c1ccc(o1)-c1ccc2ccccc2n1