Reaction Details
TargetcAMP-specific 3',5'-cyclic phosphodiesterase 4A
LigandBDBM50074970
Substrate/Competitorn/a
Meas. Tech.ChEBML_155037
IC50 770±n/a nM
Citation Perrier, HBayly, CLaliberté, FHuang, ZRasori, RRobichaud, AGirard, YMacdonald, D Substituted furans as inhibitors of the PDE4 enzyme. Bioorg Med Chem Lett9:323-6 (1999) cAMP-specific 3',5'-cyclic phosphodiesterase 4A
Name:cAMP-specific 3',5'-cyclic phosphodiesterase 4A
Type:Enzyme
Mol. Mass.:98113.27
Organism:Homo sapiens (Human)
Description:P27815
Residue:886
BDBM50074970
NameBDBM50074970
Synonyms:2-[4-Benzenesulfonyl-5-(3-cyclopentyloxy-4-methoxy-phenyl)-furan-2-yl]-pyridine | CHEMBL324542
TypeSmall organic molecule
Emp. Form.C27H25NO5S
Mol. Mass.475.556
SMILESCOc1ccc(cc1OC1CCCC1)-c1oc(cc1S(=O)(=O)c1ccccc1)-c1ccccn1