Reaction Details
TargetcAMP-specific 3',5'-cyclic phosphodiesterase 4A
LigandBDBM50074972
Substrate/Competitorn/a
Meas. Tech.ChEBML_155037
IC50 44±n/a nM
Citation Perrier, HBayly, CLaliberté, FHuang, ZRasori, RRobichaud, AGirard, YMacdonald, D Substituted furans as inhibitors of the PDE4 enzyme. Bioorg Med Chem Lett9:323-6 (1999) cAMP-specific 3',5'-cyclic phosphodiesterase 4A
Name:cAMP-specific 3',5'-cyclic phosphodiesterase 4A
Type:Enzyme
Mol. Mass.:98113.27
Organism:Homo sapiens (Human)
Description:P27815
Residue:886
BDBM50074972
NameBDBM50074972
Synonyms:2,5-Bis-(3-cyclopentyloxy-4-methoxy-phenyl)-furan | CHEMBL111506
TypeSmall organic molecule
Emp. Form.C28H32O5
Mol. Mass.448.5507
SMILESCOc1ccc(cc1OC1CCCC1)-c1ccc(o1)-c1ccc(OC)c(OC2CCCC2)c1