Reaction Details
TargetB2 bradykinin receptor
LigandBDBM50074980
Substrate/Competitorn/a
Meas. Tech.ChEMBL_216335 (CHEMBL818749)
Ki 2.8±n/a nM
Citation Heitsch, HWagner, ASchölkens, BAWirth, K Novel series of O-substituted 8-quinolines and 4-benzothiazoles as potent antagonists of the bradykinin B2 receptors. Bioorg Med Chem Lett9:327-32 (1999) B2 bradykinin receptor
Name:B2 bradykinin receptor
Type:n/a
Mol. Mass.:42217.03
Organism:Cavia porcellus
Description:n/a
Residue:372
BDBM50074980
NameBDBM50074980
Synonyms:(E)-N-({[2,4-Dichloro-3-(2-methyl-benzothiazol-4-yloxymethyl)-phenyl]-methyl-carbamoyl}-methyl)-3-(4-trifluoromethyl-phenyl)-acrylamide | CHEMBL112991
TypeSmall organic molecule
Emp. Form.C28H22Cl2F3N3O3S
Mol. Mass.608.459
SMILESCN(C(=O)CNC(=O)\C=C\c1ccc(cc1)C(F)(F)F)c1ccc(Cl)c(COc2cccc3sc(C)nc23)c1Cl