Reaction Details
TargetAromatase
LigandBDBM50075009
Substrate/Competitorn/a
Meas. Tech.ChEBML_50706
IC50 41±n/a nM
Citation Le Borgne, MMarchand, PDelevoye-Seiller, BRobert, JMLe Baut, GHartmann, RWPalzer, M New selective nonsteroidal aromatase inhibitors: synthesis and inhibitory activity of 2,3 or 5-(alpha-azolylbenzyl)-1H-indoles. Bioorg Med Chem Lett9:333-6 (1999) Aromatase
Name:Aromatase
Type:Enzyme
Mol. Mass.:57888.92
Organism:Homo sapiens (Human)
Description:P11511
Residue:503
BDBM50075009
NameBDBM50075009
Synonyms:1-Ethyl-5-[(4-fluoro-phenyl)-imidazol-1-yl-methyl]-1H-indole CHEMBL41761
TypeSmall organic molecule
Emp. Form.C20H18FN3
Mol. Mass.319.3754
SMILESCCn1ccc2cc(ccc12)C(c1ccc(F)cc1)n1ccnc1