Reaction Details
TargetChymotrypsin-like elastase family member 2A
LigandBDBM50075110
Substrate/Competitorn/a
Meas. Tech.ChEBML_158076
IC50 210±n/a nM
Citation Iijima, KKatada, JHayashi, Y Symmetrical anhydride-type serine protease inhibitors: structure-activity relationship studies of human chymase inhibitors. Bioorg Med Chem Lett9:413-8 (1999) Chymotrypsin-like elastase family member 2A
Name:Chymotrypsin-like elastase family member 2A
Type:PROTEIN
Mol. Mass.:28705.23
Organism:Sus scrofa
Description:ChEMBL_156951
Residue:269
BDBM50075110
NameBDBM50075110
Synonyms:2-(4-cyanophenylcarboxamido)-1,1-dimethyl-2-phenylpropanoic anhydride | CHEMBL134816
TypeSmall organic molecule
Emp. Form.C38H34N4O5
Mol. Mass.626.7004
SMILESCC(C)(C(NC(=O)c1ccc(cc1)C#N)c1ccccc1)C(=O)OC(=O)C(C)(C)C(NC(=O)c1ccc(cc1)C#N)c1ccccc1