Reaction Details
TargetChymotrypsinogen B
LigandBDBM50075109
Substrate/Competitorn/a
Meas. Tech.ChEMBL_216469 (CHEMBL818539)
IC50 5.3±n/a nM
Citation Iijima, KKatada, JHayashi, Y Symmetrical anhydride-type serine protease inhibitors: structure-activity relationship studies of human chymase inhibitors. Bioorg Med Chem Lett9:413-8 (1999) Chymotrypsinogen B
Name:Chymotrypsinogen B
Type:PROTEIN
Mol. Mass.:27713.98
Organism:Homo sapiens (Human)
Description:ChEMBL_10909
Residue:263
BDBM50075109
NameBDBM50075109
Synonyms:1,1-dimethyl-2-phenylcarboxamidoheptanoic anhydride | CHEMBL335675
TypeSmall organic molecule
Emp. Form.C32H44N2O5
Mol. Mass.536.7022
SMILESCCCCC(NC(=O)c1ccccc1)C(C)(C)C(=O)OC(=O)C(C)(C)C(CCCC)NC(=O)c1ccccc1