Reaction Details
TargetChymotrypsin-like elastase family member 2A
LigandBDBM50075108
Substrate/Competitorn/a
Meas. Tech.ChEBML_158076
IC50 1100±n/a nM
Citation Iijima, KKatada, JHayashi, Y Symmetrical anhydride-type serine protease inhibitors: structure-activity relationship studies of human chymase inhibitors. Bioorg Med Chem Lett9:413-8 (1999) Chymotrypsin-like elastase family member 2A
Name:Chymotrypsin-like elastase family member 2A
Type:PROTEIN
Mol. Mass.:28705.23
Organism:Sus scrofa
Description:ChEMBL_156951
Residue:269
BDBM50075108
NameBDBM50075108
Synonyms:2-(2-chlorophenyl)-2-(4-cyanophenylcarboxamido)-1,1-dimethylpropanoic anhydride | CHEMBL338962
TypeSmall organic molecule
Emp. Form.C38H32Cl2N4O5
Mol. Mass.695.59
SMILESCC(C)(C(NC(=O)c1ccc(cc1)C#N)c1ccccc1Cl)C(=O)OC(=O)C(C)(C)C(NC(=O)c1ccc(cc1)C#N)c1ccccc1Cl