Reaction Details
TargetProlyl endopeptidase
LigandBDBM50075125
Substrate/Competitorn/a
Meas. Tech.ChEBML_157469
IC50 23±n/a nM
Citation Vendeville, SBourel, LDavioud-Charvet, EGrellier, PDeprez, BSergheraert, C Automated parallel synthesis of a tetrahydroisoquinolin-based library: potential prolyl endopeptidase inhibitors. Bioorg Med Chem Lett9:437-42 (1999) Prolyl endopeptidase
Name:Prolyl endopeptidase
Type:Enzyme
Mol. Mass.:80688.50
Organism:Homo sapiens (Human)
Description:P48147
Residue:710
BDBM50075125
NameBDBM50075125
Synonyms:((1S,2S)-2-Phenyl-cyclopropyl)-[(S)-3-(pyrrolidine-1-carbonyl)-3,4-dihydro-1H-isoquinolin-2-yl]-methanone | CHEMBL139696
TypeSmall organic molecule
Emp. Form.C24H26N2O2
Mol. Mass.374.4754
SMILESO=C([C@H]1C[C@@H]1c1ccccc1)N1Cc2ccccc2C[C@H]1C(=O)N1CCCC1