Reaction Details
TargetCapsid scaffolding protein
LigandBDBM50075145
Substrate/Competitorn/a
Meas. Tech.ChEBML_43071
IC50 1700±n/a nM
Citation Jarvest, RLPinto, ILAshman, SMDabrowski, CEFernandez, AVJennings, LJLavery, PTew, DG Inhibition of herpes proteases and antiviral activity of 2-substituted thieno[2,3-d]oxazinones. Bioorg Med Chem Lett9:443-8 (1999) Capsid scaffolding protein
Name:Capsid scaffolding protein
Type:PROTEIN
Mol. Mass.:64105.26
Organism:Epstein-Barr virus (strain B95-8) (HHV-4) (Human herpesvirus 4)
Description:ChEMBL_43071
Residue:605
BDBM50075145
NameBDBM50075145
Synonyms:(E)-3-(2,6-Difluoro-phenyl)-N-[(S)-1-(5-methyl-4-oxo-4H-thieno[2,3-d][1,3]oxazin-2-yl)-ethyl]-acrylamide | CHEMBL341787
TypeSmall organic molecule
Emp. Form.C18H14F2N2O3S
Mol. Mass.376.377
SMILESC[C@H](NC(=O)\C=C\c1c(F)cccc1F)c1nc2scc(C)c2c(=O)o1