Reaction Details
TargetCapsid scaffolding protein
LigandBDBM50075176
Substrate/Competitorn/a
Meas. Tech.ChEBML_43065
IC50 30±n/a nM
Citation Pinto, ILJarvest, RLClarke, BDabrowski, CEFenwick, AGorczyca, MMJennings, LJLavery, PSternberg, EJTew, DGWest, A Inhibition of human cytomegalovirus protease by enedione derivatives of thieno[2,3-d]oxazinones through a novel dual acylation/alkylation mechanism. Bioorg Med Chem Lett9:449-52 (1999) Capsid scaffolding protein
Name:Capsid scaffolding protein
Type:PROTEIN
Mol. Mass.:73854.16
Organism:Human cytomegalovirus (strain AD169) (HHV-5) (Human herpesvirus 5)
Description:ChEMBL_158958
Residue:708
BDBM50075176
NameBDBM50075176
Synonyms:(E)-4-Oxo-4-phenyl-but-2-enoic acid [(S)-1-(5-methyl-4-oxo-4H-thieno[2,3-d][1,3]oxazin-2-yl)-ethyl]-amide | CHEMBL141812
TypeSmall organic molecule
Emp. Form.C19H16N2O4S
Mol. Mass.368.406
SMILESC[C@H](NC(=O)\C=C\C(=O)c1ccccc1)c1nc2scc(C)c2c(=O)o1