Reaction Details
TargetSomatostatin receptor type 2
LigandBDBM50075292
Substrate/Competitorn/a
Meas. Tech.ChEBML_200682
Ki 1±n/a nM
Citation Pasternak, APan, YMarino, DSanderson, PEMosley, RRohrer, SPBirzin, ETHuskey, SEJacks, TSchleim, KDCheng, KSchaeffer, JMPatchett, AAYang, L Potent, orally bioavailable somatostatin agonists: good absorption achieved by urea backbone cyclization. Bioorg Med Chem Lett9:491-6 (1999) Somatostatin receptor type 2
Name:Somatostatin receptor type 2
Type:Enzyme
Mol. Mass.:41344.94
Organism:Homo sapiens (Human)
Description:P30874
Residue:369
BDBM50075292
NameBDBM50075292
Synonyms:(R)-6-Amino-2-{(2R,3S)-3-(1H-indol-3-yl)-2-[3-(3-phenyl-propyl)-ureido]-butyrylamino}-hexanoic acid tert-butyl ester | CHEMBL355923
TypeSmall organic molecule
Emp. Form.C32H45N5O4
Mol. Mass.563.7308
SMILESC[C@H]([C@@H](NC(=O)NCCCc1ccccc1)C(=O)N[C@H](CCCCN)C(=O)OC(C)(C)C)c1c[nH]c2ccccc12