Reaction Details
TargetD(4) dopamine receptor
LigandBDBM50450987
Substrate/Competitorn/a
Meas. Tech.ChEBML_58929
Ki 6.5±n/a nM
Citation Curtis, NRKulagowski, JJLeeson, PDRidgill, MPEmms, FFreedman, SBPatel, SPatel, S Synthesis and sar of 2- and 3-substituted 7-azaindoles as potential dopamine D4 ligands. Bioorg Med Chem Lett9:585-8 (1999) D(4) dopamine receptor
Name:D(4) dopamine receptor
Type:Enzyme
Mol. Mass.:48373.19
Organism:Homo sapiens (Human)
Description:P21917
Residue:419
BDBM50450987
NameBDBM50450987
Synonyms:CHEMBL2112913
TypeSmall organic molecule
Emp. Form.C22H23N3
Mol. Mass.329.4381
SMILESC(Cc1c[nH]c2ncccc12)N1CCC(\C=C\c2ccccc2)=CC1