Reaction Details
TargetProstaglandin G/H synthase 2
LigandBDBM50029616
Substrate/Competitorn/a
Meas. Tech.ChEMBL_44004 (CHEMBL655570)
IC50 70.0±n/a nM
Citation Song, YConnor, DTDoubleday, RSorenson, RJSercel, ADUnangst, PCRoth, BDGilbertsen, RBChan, KSchrier, DJGuglietta, ABornemeier, DADyer, RD Synthesis, structure-activity relationships, and in vivo evaluations of substituted di-tert-butylphenols as a novel class of potent, selective, and orally active cyclooxygenase-2 inhibitors. 1. Thiazolone and oxazolone series. J Med Chem42:1151-60 (1999) 
 
Prostaglandin G/H synthase 2
Name:Prostaglandin G/H synthase 2
Type:Protein
Mol. Mass.:69020.39
Organism:Mus musculus (Mouse)
Description:Q05769
Residue:604
BDBM50029616
NameBDBM50029616
Synonyms:5-(4-Fluoro-phenyl)-1-(4-methanesulfonyl-phenyl)-3-trifluoromethyl-1H-pyrazole CHEMBL274990 SC58125
TypeSmall organic molecule
Emp. Form.C17H12F4N2O2S
Mol. Mass.384.348
SMILESCS(=O)(=O)c1ccc(cc1)-n1nc(cc1-c1ccc(F)cc1)C(F)(F)F