Reaction Details
TargetLanosterol synthase
LigandBDBM50052351
Substrate/Competitorn/a
Meas. Tech.ChEMBL_148908 (CHEMBL756145)
IC50>100±n/a nM
Citation Brown, GRHollinshead, DMStokes, ESClarke, DSEakin, MAFoubister, AJGlossop, SCGriffiths, DJohnson, MCMcTaggart, FMirrlees, DJSmith, GJWood, R Quinuclidine inhibitors of 2,3-oxidosqualene cyclase-lanosterol synthase: optimization from lipid profiles. J Med Chem42:1306-11 (1999) 
 
Lanosterol synthase
Name:Lanosterol synthase
Type:PROTEIN
Mol. Mass.:83302.12
Organism:Rattus norvegicus
Description:ChEMBL_12083
Residue:733
BDBM50052351
NameBDBM50052351
Synonyms:3-Biphenyl-4-yl-1-aza-bicyclo[2.2.2]octan-3-ol CHEMBL279261
TypeSmall organic molecule
Emp. Form.C19H21NO
Mol. Mass.279.3761
SMILESOC1(CN2CCC1CC2)c1ccc(cc1)-c1ccccc1