Reaction Details
TargetVasopressin V1a receptor
LigandBDBM50075725
Substrate/Competitorn/a
Meas. Tech.ChEMBL_214419 (CHEMBL820283)
Ki 0.17±n/a nM
Citation Durroux, TPeter, MTurcatti, GChollet, ABalestre, MNBarberis, CSeyer, R Fluorescent pseudo-peptide linear vasopressin antagonists: design, synthesis, and applications. J Med Chem42:1312-9 (1999) 
 
Vasopressin V1a receptor
Name:Vasopressin V1a receptor
Type:Receptor
Mol. Mass.:46820.18
Organism:Homo sapiens (Human)
Description:P37288
Residue:418
BDBM50075725
NameBDBM50075725
Synonyms:4HOPh(CH2)2CO-DTyr(Me)-Phe-Gln-Asn-Arg-Pro-Lys(6C-Rhm)-NH2 | CHEMBL430272
TypeSmall organic molecule
Emp. Form.C79H96N16O16
Mol. Mass.1525.7051
SMILESCN(C)c1ccc2c(Oc3cc(ccc3C22OC(=O)c3ccc(cc23)C(=O)N([C@@H](CCCCN)C(N)=O)C(=O)[C@@H]2CCCN2C(=O)[C@H](CCCNC(N)=N)NC(=O)[C@H](CC(N)=O)NC(=O)[C@H](CCC(N)=O)NC(=O)[C@H](Cc2ccccc2)NC(=O)[C@@H](Cc2ccc(O)cc2)N(C)C(=O)CCc2ccc(O)cc2)N(C)C)c1