Reaction Details
TargetNeuropeptide Y receptor type 1
LigandBDBM50075797
Substrate/Competitorn/a
Meas. Tech.ChEBML_143824
Ki 0.285000±n/a nM
Citation Zarrinmayeh, HZimmerman, DMCantrell, BESchober, DABruns, RFGackenheimer, SLOrnstein, PLHipskind, PABritton, TCGehlert, DR Structure-activity relationship of a series of diaminoalkyl substituted benzimidazole as neuropeptide Y Y1 receptor antagonists. Bioorg Med Chem Lett9:647-52 (1999) Neuropeptide Y receptor type 1
Name:Neuropeptide Y receptor type 1
Type:Enzyme Catalytic Domain
Mol. Mass.:44399.07
Organism:Homo sapiens (Human)
Description:NPY-Y1 NPY1R HUMAN::P25929
Residue:384
BDBM50075797
NameBDBM50075797
Synonyms:1-{3-[1-(2-Cyclohexyl-ethyl)-piperidin-4-yl]-propyl}-2-phenoxymethyl-4-(3-piperidin-1-yl-propoxy)-1H-benzoimidazole | CHEMBL156076
TypeSmall organic molecule
Emp. Form.C38H56N4O2
Mol. Mass.600.8768
SMILESC(COc1cccc2n(CCCC3CCN(CCC4CCCCC4)CC3)c(COc3ccccc3)nc12)CN1CCCCC1