Reaction Details
TargetNeuropeptide Y receptor type 1
LigandBDBM50075805
Substrate/Competitorn/a
Meas. Tech.ChEBML_143824
Ki 4.5±n/a nM
Citation Zarrinmayeh, HZimmerman, DMCantrell, BESchober, DABruns, RFGackenheimer, SLOrnstein, PLHipskind, PABritton, TCGehlert, DR Structure-activity relationship of a series of diaminoalkyl substituted benzimidazole as neuropeptide Y Y1 receptor antagonists. Bioorg Med Chem Lett9:647-52 (1999) Neuropeptide Y receptor type 1
Name:Neuropeptide Y receptor type 1
Type:Enzyme Catalytic Domain
Mol. Mass.:44399.07
Organism:Homo sapiens (Human)
Description:NPY-Y1 NPY1R HUMAN::P25929
Residue:384
BDBM50075805
NameBDBM50075805
Synonyms:2-Phenoxymethyl-4-(3-piperidin-1-yl-propoxy)-1-(3-piperidin-4-yl-propyl)-1H-benzoimidazole | CHEMBL265752
TypeSmall organic molecule
Emp. Form.C30H42N4O2
Mol. Mass.490.6801
SMILESC(COc1cccc2n(CCCC3CCNCC3)c(COc3ccccc3)nc12)CN1CCCCC1