Reaction Details
TargetNeuropeptide Y receptor type 1
LigandBDBM50075810
Substrate/Competitorn/a
Meas. Tech.ChEBML_143824
Ki 1.6±n/a nM
Citation Zarrinmayeh, HZimmerman, DMCantrell, BESchober, DABruns, RFGackenheimer, SLOrnstein, PLHipskind, PABritton, TCGehlert, DR Structure-activity relationship of a series of diaminoalkyl substituted benzimidazole as neuropeptide Y Y1 receptor antagonists. Bioorg Med Chem Lett9:647-52 (1999) Neuropeptide Y receptor type 1
Name:Neuropeptide Y receptor type 1
Type:Enzyme Catalytic Domain
Mol. Mass.:44399.07
Organism:Homo sapiens (Human)
Description:NPY-Y1 NPY1R HUMAN::P25929
Residue:384
BDBM50075810
NameBDBM50075810
Synonyms:1-[3-(1-Isopropyl-piperidin-4-yl)-propyl]-2-phenoxymethyl-4-(3-piperidin-1-yl-propoxy)-1H-benzoimidazole | CHEMBL158392
TypeSmall organic molecule
Emp. Form.C33H48N4O2
Mol. Mass.532.7598
SMILESCC(C)N1CCC(CCCn2c(COc3ccccc3)nc3c(OCCCN4CCCCC4)cccc23)CC1