Reaction Details
TargetCarboxypeptidase A1
LigandBDBM50075829
Substrate/Competitorn/a
Meas. Tech.ChEBML_45622
Ki 320±n/a nM
Citation Kim, DHJin, Y First hydroxamate inhibitors for carboxypeptidase A. N-acyl-N-hydroxy-beta-phenylalanines. Bioorg Med Chem Lett9:691-6 (1999) Carboxypeptidase A1
Name:Carboxypeptidase A1
Type:PROTEIN
Mol. Mass.:47132.61
Organism:Homo sapiens (Human)
Description:ChEMBL_1496378
Residue:419
BDBM50075829
NameBDBM50075829
Synonyms:2-Benzyl-3-(hydroxy-phenylacetyl-amino)-propionic acid | CHEMBL161702
TypeSmall organic molecule
Emp. Form.C18H19NO4
Mol. Mass.313.3478
SMILESON(CC(Cc1ccccc1)C(O)=O)C(=O)Cc1ccccc1