Reaction Details
TargetCarboxypeptidase A1
LigandBDBM50075832
Substrate/Competitorn/a
Meas. Tech.ChEBML_45622
Ki 560.0±n/a nM
Citation Kim, DHJin, Y First hydroxamate inhibitors for carboxypeptidase A. N-acyl-N-hydroxy-beta-phenylalanines. Bioorg Med Chem Lett9:691-6 (1999) Carboxypeptidase A1
Name:Carboxypeptidase A1
Type:PROTEIN
Mol. Mass.:47132.61
Organism:Homo sapiens (Human)
Description:ChEMBL_1496378
Residue:419
BDBM50075832
NameBDBM50075832
Synonyms:(R)-2-Benzyl-3-(formyl-hydroxy-amino)-propionic acid | CHEMBL161819
TypeSmall organic molecule
Emp. Form.C11H13NO4
Mol. Mass.223.2252
SMILESON(C[C@@H](Cc1ccccc1)C(O)=O)C=O