Reaction Details
TargetProtein farnesyltransferase subunit beta/geranylgeranyltransferase type-1 subunit alpha
LigandBDBM50075838
Substrate/Competitorn/a
Meas. Tech.ChEBML_70297
IC50 0.590000±n/a nM
Citation Shen, WFakhoury, SDonner, GHenry, KLee, JZhang, HCohen, JWarner, RSaeed, BCherian, STahir, SKovar, PBauch, JNg, SCMarsh, KSham, HRosenberg, S Potent inhibitors of protein farnesyltransferase: heteroarenes as cysteine replacements. Bioorg Med Chem Lett9:703-8 (1999) Protein farnesyltransferase subunit beta/geranylgeranyltransferase type-1 subunit alpha
Name:Protein farnesyltransferase subunit beta/geranylgeranyltransferase type-1 subunit alpha
Type:Protein Complex
Mol. Mass.:n/a
Description:To express recombinant enzyme in E. coli, the cloned human alpha and beta subunits were co-expressed from a plasmid, in which their expression was translationally coupled.
Components:This complex has 2 components.
Component 1
Name:Protein farnesyltransferase subunit beta
Synonyms:CAAX farnesyltransferase subunit alpha FNTB FTase-alpha GGTase-I-alpha Protein farnesyl/geranylgeranyl transferase Protein farnesyltransferase subunit beta Protein farnesyltransferase/geranylgeranyltransferase type-1 subunit alpha Ras proteins prenyltransferase subunit beta | Type I protein geranyl-geranyltransferase subunit alpha
Type:Enzyme Subunit
Mol. Mass.:48766.02
Organism:Homo sapiens (Human)
Description:Protein farnesyltransferase subunit beta
Residue:437
Component 2
Name:Protein farnesyltransferase/geranylgeranyltransferase type-1 subunit alpha
Synonyms:CAAX farnesyltransferase alpha subunit FNTA_HUMAN FTase-alpha Geranylgeranyl Transferase (GGTase-I) Chain A Protein Farnesyltransferase (PFT) Chain A Protein farnesyltransferase Protein farnesyltransferase/geranylgeranyltransferase type I alpha subunit | Ras proteins prenyltransferase alpha
Type:Enzyme
Mol. Mass.:44392.46
Organism:Homo sapiens (Human)
Description:Recombinant human FTase.
Residue:379
BDBM50075838
NameBDBM50075838
Synonyms:(S)-2-{[5-((Z)-1-Cyano-2-pyridin-3-yl-vinyl)-2'-methyl-biphenyl-2-carbonyl]-amino}-4-methylsulfanyl-butyric acid | CHEMBL159324
TypeSmall organic molecule
Emp. Form.C27H25N3O3S
Mol. Mass.471.571
SMILESCSCC[C@H](NC(=O)c1ccc(cc1-c1ccccc1C)C(=C\c1cccnc1)\C#N)C(O)=O