Reaction Details
TargetProtein farnesyltransferase subunit beta/geranylgeranyltransferase type-1 subunit alpha
LigandBDBM50075867
Substrate/Competitorn/a
Meas. Tech.ChEBML_70297
IC50 0.580000±n/a nM
Citation Shen, WFakhoury, SDonner, GHenry, KLee, JZhang, HCohen, JWarner, RSaeed, BCherian, STahir, SKovar, PBauch, JNg, SCMarsh, KSham, HRosenberg, S Potent inhibitors of protein farnesyltransferase: heteroarenes as cysteine replacements. Bioorg Med Chem Lett9:703-8 (1999) Protein farnesyltransferase subunit beta/geranylgeranyltransferase type-1 subunit alpha
Name:Protein farnesyltransferase subunit beta/geranylgeranyltransferase type-1 subunit alpha
Type:Protein Complex
Mol. Mass.:n/a
Description:To express recombinant enzyme in E. coli, the cloned human alpha and beta subunits were co-expressed from a plasmid, in which their expression was translationally coupled.
Components:This complex has 2 components.
Component 1
Name:Protein farnesyltransferase subunit beta
Synonyms:CAAX farnesyltransferase subunit alpha FNTB FTase-alpha GGTase-I-alpha Protein farnesyl/geranylgeranyl transferase Protein farnesyltransferase subunit beta Protein farnesyltransferase/geranylgeranyltransferase type-1 subunit alpha Ras proteins prenyltransferase subunit beta | Type I protein geranyl-geranyltransferase subunit alpha
Type:Enzyme Subunit
Mol. Mass.:48766.02
Organism:Homo sapiens (Human)
Description:Protein farnesyltransferase subunit beta
Residue:437
Component 2
Name:Protein farnesyltransferase/geranylgeranyltransferase type-1 subunit alpha
Synonyms:CAAX farnesyltransferase alpha subunit FNTA_HUMAN FTase-alpha Geranylgeranyl Transferase (GGTase-I) Chain A Protein Farnesyltransferase (PFT) Chain A Protein farnesyltransferase Protein farnesyltransferase/geranylgeranyltransferase type I alpha subunit | Ras proteins prenyltransferase alpha
Type:Enzyme
Mol. Mass.:44392.46
Organism:Homo sapiens (Human)
Description:Recombinant human FTase.
Residue:379
BDBM50075867
NameBDBM50075867
Synonyms:(S)-2-[(5-{2-[(E)-4-(Hydroxy-phenyl-methyl)-pyridin-3-yl]-vinyl}-2'-methyl-biphenyl-2-carbonyl)-amino]-4-methylsulfanyl-butyric acid | CHEMBL159390
TypeSmall organic molecule
Emp. Form.C33H32N2O4S
Mol. Mass.552.683
SMILESCSCC[C@H](NC(=O)c1ccc(\C=C\c2cnccc2C(O)c2ccccc2)cc1-c1ccccc1C)C(O)=O