Reaction Details
TargetProthrombin
LigandBDBM50073283
Substrate/Competitorn/a
Meas. Tech.ChEMBL_208353 (CHEMBL813663)
Ki 19±n/a nM
Citation Ambler, JBaker, EBentley, DBrown, LButler, KButler, PFarr, DDunnet, KLe Grand, DHayler, JJanus, DJones, DMenear, KMercer, MSmith, GTalbot, MTweed, M Studies towards the identification of potent, selective and bioavailable thrombin inhibitors. Bioorg Med Chem Lett9:737-42 (1999) Prothrombin
Name:Prothrombin
Type:Protein
Mol. Mass.:70029.57
Organism:Homo sapiens (Human)
Description:P00734
Residue:622
BDBM50073283
NameBDBM50073283
Synonyms:4-[(S)-1-Hydroxymethyl-2-(4-methoxy-phenyl)-ethylamino]-pyridine-3-sulfonic acid {(S)-1-(4-amino-benzyl)-2-[4-(2-fluoro-ethyl)-piperidin-1-yl]-2-oxo-ethyl}-amide | CHEMBL121423
TypeSmall organic molecule
Emp. Form.C31H40FN5O5S
Mol. Mass.613.743
SMILESCOc1ccc(C[C@@H](CO)Nc2ccncc2S(=O)(=O)N[C@@H](Cc2ccc(N)cc2)C(=O)N2CCC(CCF)CC2)cc1