Reaction Details
TargetRetinoic acid receptor alpha
LigandBDBM50075880
Substrate/Competitorn/a
Meas. Tech.ChEBML_225937
IC50 20±n/a nM
Citation Vuligonda, VStandeven, AMEscobar, MChandraratna, RA A new class of potent RAR antagonists: dihydroanthracenyl, benzochromenyl and benzothiochromenyl retinoids. Bioorg Med Chem Lett9:743-8 (1999) Retinoic acid receptor alpha
Name:Retinoic acid receptor alpha
Type:PROTEIN
Mol. Mass.:50778.87
Organism:Homo sapiens (Human)
Description:ChEMBL_1466191
Residue:462
BDBM50075880
NameBDBM50075880
Synonyms:4-(5,5-Dimethyl-8-p-tolyl-5,6-dihydro-anthracen-2-yl)-benzoic acid | CHEMBL162393
TypeSmall organic molecule
Emp. Form.C30H26O2
Mol. Mass.418.5262
SMILESCc1ccc(cc1)C1=CCC(C)(C)c2cc3ccc(cc3cc12)-c1ccc(cc1)C(O)=O